Error in Bitbake

Jump to: navigation, search
Revision as of 23 February 2017 at 14:43.
The highlighted comment was created in this revision.

Hi

I followed all the steps to make yocto image.
I get the following error during bitbake.
Please tell me How can i solve this error.

Regard.



Build Configuration:
BB_VERSION = "1.28.0"
BUILD_SYS = "x86_64-linux"
NATIVELSBSTRING = "Ubuntu-14.04"
TARGET_SYS = "aarch64-poky-linux"
MACHINE = "m3ulcb"
DISTRO = "poky"
DISTRO_VERSION = "2.0.2"
TUNE_FEATURES = "aarch64 cortexa57-cortexa53"
TARGET_FPU = ""
SOC_FAMILY = "rcar-gen3:r8a7796"
meta
meta-yocto
meta-yocto-bsp = "tmp:40376446904ae3529be41737fed9a0b650ed167d"
meta-rcar-gen3 = "v2.12.0:2b0598e0a252a8cf1dc4edacf4ef3a7071dbfd87"
meta-linaro-toolchain = "tmp:9b1fd178309544dff1f7453e796a9437125bc0d9"
meta-oe = "tmp:8ab04afbffb4bc5184cfe0655049de6f44269990"






In file included from .../work/build/tmp/work/aarch64-poky-linux/gstreamer1.0-plugins-bad/1.4.5-r0/git/ext/wayland/gstwaylandsink.h:30:0,
from .../work/build/tmp/work/aarch64-poky-linux/gstreamer1.0-plugins-bad/1.4.5-r0/git/ext/wayland/gstwaylandsink.c:44:
.../work/build/tmp/work/aarch64-poky-linux/gstreamer1.0-plugins-bad/1.4.5-r0/git/ext/wayland/wldisplay.h:27:42: fatal error: linux-dmabuf-client-protocol.h: No such file or directory
compilation terminated.
make[3]: *** [libgstwaylandsink_la-gstwaylandsink.lo] Error 1
make[3]: Leaving directory `.../work/build/tmp/work/aarch64-poky-linux/gstreamer1.0-plugins-bad/1.4.5-r0/build/ext/wayland'
make[2]: *** [wayland] Error 2
make[2]: Leaving directory `.../work/build/tmp/work/aarch64-poky-linux/gstreamer1.0-plugins-bad/1.4.5-r0/build/ext'
make[1]: *** [all-recursive] Error 1
make[1]: Leaving directory `.../work/build/tmp/work/aarch64-poky-linux/gstreamer1.0-plugins-bad/1.4.5-r0/build'
make: *** [all] Error 2
WARNING: exit code 1 from a shell command.
ERROR: oe_runmake failed
ERROR: Function failed: do_compile (log file is located at .../work/build/tmp/work/aarch64-poky-linux/gstreamer1.0-plugins-bad/1.4.5-r0/temp/log.do_compile.2811)
ERROR: Task 2138 (.../work/build/../poky/meta/recipes-multimedia/gstreamer/gstreamer1.0-plugins-bad_1.4.5.bb, do_compile) failed with exit code '1'
NOTE: Tasks Summary: Attempted 2510 tasks of which 2509 didn't need to be rerun and 1 failed.
No currently running tasks (2509 of 4905)

    19:40, 12 January 2017

    Hi

    I have the same problem. Did anyone find any solution in the meantime?

    Regard.

      06:43, 23 February 2017